Target
Vasopressin V2 receptor
Ligand
BDBM50177592
Substrate
Meas. Tech.
ChEMBL_334037 (CHEMBL862397)
EC50
1.67±n/a nM
Citation
 Failli, AAShumsky, JSSteffan, RJCaggiano, TJWilliams, DKTrybulski, EJNing, XLock, YTanikella, THartmann, DChan, PSPark, CH Pyridobenzodiazepines: a novel class of orally active, vasopressin V2 receptor selective agonists. Bioorg Med Chem Lett 16:954-9 (2006)  
Target
Name:
Vasopressin V2 receptor
Synonyms:
ADHR AVPR2 DIR Renal-type arginine vasopressin receptor V2R_HUMAN Vasopressin V2 receptor | Vasopressin receptor
Type:
Receptor
Mol. Mass.:
40295.28
Organism:
Homo sapiens (Human)
Description:
P30518
Residue:
371
  
Inhibitor
Name:
BDBM50177592
Synonyms:
(5,11-dihydro-benzo[b]pyrido[2,3-e][1,4]diazepin-6-yl)-[4-(3-methyl-pyrazol-1-yl)-2-trifluoromethyl-phenyl]-methanone | CHEMBL201889
Type:
Small organic molecule
Emp. Form.:
C24H18F3N5O
Mol. Mass.:
449.4278
SMILES:
Cc1ccn(n1)-c1ccc(C(=O)N2Cc3cccnc3Nc3ccccc23)c(c1)C(F)(F)F
: