Target
Adenosine receptor A3
Ligand
BDBM50183525
Substrate
Meas. Tech.
ChEMBL_337186 (CHEMBL862546)
Ki
0.44±n/a nM
Citation
 Pastorin, GDa Ros, TBolcato, CMontopoli, CMoro, SCacciari, BBaraldi, PGVarani, KBorea, PASpalluto, G Synthesis and biological studies of a new series of 5-heteroarylcarbamoylaminopyrazolo[4,3-e]1,2,4-triazolo[1,5-c]pyrimidines as human A3 adenosine receptor antagonists. Influence of the heteroaryl substituent on binding affinity and molecular modeling investigations. J Med Chem 49:1720-9 (2006)  
Target
Name:
Adenosine receptor A3
Synonyms:
A3 adenosine receptor (hA3) ADORA3 | Adenosine A3 receptor (A3AR)
Type:
G Protein-Coupled Receptor (GPCR)
Mol. Mass.:
36197.32
Organism:
Homo sapiens (Human)
Description:
P0DMS8
Residue:
318
  
Inhibitor
Name:
BDBM50183525
Synonyms:
5-[[(3-pyridyl)amino]carbonyl]amino-8-methyl-2-(2-furyl)-pyrazolo[4,3-e]-1,2,4-triazolo[1,5-c]pyrimidine CHEMBL534489
Type:
Small organic molecule
Emp. Form.:
C17H13N9O2
Mol. Mass.:
375.3442
SMILES:
Cn1cc2c(n1)nc(NC(=O)Nc1cccnc1)n1nc(nc21)-c1ccco1
: