Target
P2Y purinoceptor 2
Ligand
BDBM50184369
Substrate
Meas. Tech.
ChEMBL_338252 (CHEMBL867178)
EC50
30000±n/a nM
Citation
 Nahum, VTulapurkar, MLévesque, SASévigny, JReiser, GFischer, B Diadenosine and diuridine poly(borano)phosphate analogues: synthesis, chemical and enzymatic stability, and activity at P2Y1 and P2Y2 receptors. J Med Chem 49:1980-90 (2006)  
Target
Name:
P2Y purinoceptor 2
Synonyms:
ATP receptor P2RY2 P2U purinoceptor 1 P2Y purinoceptor 2 Purinergic receptor | Purinergic receptor P2Y2
Type:
PROTEIN
Mol. Mass.:
42299.21
Organism:
Homo sapiens (Human)
Description:
ChEMBL_1455361
Residue:
377
  
Inhibitor
Name:
BDBM50184369
Synonyms:
CHEMBL413131 | pentakis(tributylamine) boranuidyl({[({[(2R,3S,4R,5R)-5-(2,4-dioxo-1,2,3,4-tetrahydropyrimidin-1-yl)-3,4-dihydroxyoxolan-2-yl]methyl phosphonato}oxy)phosphinato]oxy})phosphoryl ({[(2R,3S,4R,5R)-5-(2,4-dioxo-1,2,3,4-tetrahydropyrimidin-1-yl)-3,4-dihydroxyoxolan-2-yl]methyl phosphonato}oxy)phosphonate
Type:
Small organic molecule
Emp. Form.:
C18H25BN4O25P5
Mol. Mass.:
863.085
SMILES:
[BH3-]P(=O)(OP([O-])(=O)OP([O-])(=O)OC[C@H]1O[C@H]([C@H](O)[C@@H]1O)n1ccc(=O)[nH]c1=O)OP([O-])(=O)OP([O-])(=O)OC[C@H]1O[C@H]([C@H](O)[C@@H]1O)n1ccc(=O)[nH]c1=O
: