Target
Gag-Pol polyprotein [489-587]
Ligand
BDBM50183631
Substrate
Meas. Tech.
ChEMBL_340965 (CHEMBL866517)
Ki
2.1±n/a nM
Citation
 Ekegren, JKGinman, NJohansson, AWallberg, HLarhed, MSamuelsson, BUnge, THallberg, A Microwave-accelerated synthesis of P1'-extended HIV-1 protease inhibitors encompassing a tertiary alcohol in the transition-state mimicking scaffold. J Med Chem 49:1828-32 (2006)  
Target
Name:
Gag-Pol polyprotein [489-587]
Synonyms:
Human immunodeficiency virus type 1 protease Pol polyprotein | gag-pol
Type:
Enzyme Subunit
Mol. Mass.:
10781.16
Organism:
Human immunodeficiency virus type 1
Description:
P04585[489-587]
Residue:
99
  
Inhibitor
Name:
BDBM50183631
Synonyms:
CHEMBL380970 | {(1S)-1-[N'-[(2S)-2-hydroxy-2-((1S,2R)-2-hydroxy-indan-1-ylcarbamoyl)-3-phenyl-propyl]-N'-[4-(pyrazine-2-yl)-benzyl]-hydrazinocarbonyl]-2,2-dimethyl-propyl}-carbamic acid methyl ester
Type:
Small organic molecule
Emp. Form.:
C38H44N6O6
Mol. Mass.:
680.7926
SMILES:
COC(=O)N[C@H](C(=O)NN(Cc1ccc(cc1)-c1cnccn1)C[C@@](O)(Cc1ccccc1)C(=O)N[C@@H]1[C@H](O)Cc2ccccc12)C(C)(C)C
: