Target
Proto-oncogene tyrosine-protein kinase Src
Ligand
BDBM50187720
Substrate
Meas. Tech.
ChEMBL_361955 (CHEMBL859180)
IC50
16000±n/a nM
Citation
 Kumar, AYe, GWang, YLin, XSun, GParang, K Synthesis and structure-activity relationships of linear and conformationally constrained peptide analogues of CIYKYY as Src tyrosine kinase inhibitors. J Med Chem 49:3395-401 (2006)  
Target
Name:
Proto-oncogene tyrosine-protein kinase Src
Synonyms:
Calmodulin/Proto-oncogene tyrosine-protein kinase Src Proto-oncogene c-Src SRC SRC_HUMAN V-src sarcoma (Schmidt-Ruppin A-2) viral oncogene homolog (avian) p60-Src | pp60c-src
Type:
Protein
Mol. Mass.:
59838.60
Organism:
Homo sapiens (Human)
Description:
P12931
Residue:
536
  
Inhibitor
Name:
BDBM50187720
Synonyms:
CHEMBL380288 | Cyclo[Ac-Cys-Ile-Tyr-Lys-Tyr-Phe]
Type:
Small organic molecule
Emp. Form.:
C46H60N8O11S
Mol. Mass.:
933.081
SMILES:
CC[C@H](C)C1NC(=O)[C@H](CS)NC(=O)CCC(=O)Nc2ccc(C[C@H](NC(=O)[C@H](Cc3ccc(O)cc3)NC(=O)[C@H](CCCCN)NC(=O)[C@H](Cc3ccc(O)cc3)NC1=O)C(O)=O)cc2
: