Target
Proto-oncogene tyrosine-protein kinase Src
Ligand
BDBM50370737
Substrate
Meas. Tech.
ChEMBL_361955 (CHEMBL859180)
IC50
7300±n/a nM
Citation
 Kumar, AYe, GWang, YLin, XSun, GParang, K Synthesis and structure-activity relationships of linear and conformationally constrained peptide analogues of CIYKYY as Src tyrosine kinase inhibitors. J Med Chem 49:3395-401 (2006)  
Target
Name:
Proto-oncogene tyrosine-protein kinase Src
Synonyms:
Calmodulin/Proto-oncogene tyrosine-protein kinase Src Proto-oncogene c-Src SRC SRC_HUMAN V-src sarcoma (Schmidt-Ruppin A-2) viral oncogene homolog (avian) p60-Src | pp60c-src
Type:
Protein
Mol. Mass.:
59838.60
Organism:
Homo sapiens (Human)
Description:
P12931
Residue:
536
  
Inhibitor
Name:
BDBM50370737
Synonyms:
CHEMBL1791356
Type:
Small organic molecule
Emp. Form.:
C44H58ClN7O10S
Mol. Mass.:
912.49
SMILES:
CC[C@H](C)[C@H](NC(=O)[C@H](CS)NC(C)=O)C(=O)N[C@@H](Cc1ccc(O)cc1)C(=O)N[C@@H](CCCCN)C(=O)N[C@@H](Cc1ccc(Cl)cc1)C(=O)N[C@@H](Cc1ccc(O)cc1)C(O)=O
: