Target
Solute carrier family 15 member 1
Ligand
BDBM50188482
Substrate
Meas. Tech.
ChEMBL_363882 (CHEMBL863213)
IC50
240000±n/a nM
Citation
 Vig, BSStouch, TRTimoszyk, JKQuan, YWall, DASmith, RLFaria, TN Human PEPT1 pharmacophore distinguishes between dipeptide transport and binding. J Med Chem 49:3636-44 (2006)  
Target
Name:
Solute carrier family 15 member 1
Synonyms:
Intestinal H(+)/peptide cotransporter Oligopeptide transporter, small intestine isoform Peptide transporter 1 SLC15A1
Type:
PROTEIN
Mol. Mass.:
78818.07
Organism:
Homo sapiens (Human)
Description:
ChEMBL_1488839
Residue:
708
  
Inhibitor
Name:
BDBM50188482
Synonyms:
CHEMBL209341 | Gly-Leu-Gly
Type:
Small organic molecule
Emp. Form.:
C10H19N3O4
Mol. Mass.:
245.2756
SMILES:
CC(C)C[C@H](NC(=O)CN)C(=O)NCC(O)=O
: