Target
Endoplasmin
Ligand
BDBM50191364
Substrate
Meas. Tech.
ChEMBL_365492 (CHEMBL867908)
EC50
72±n/a nM
Citation
 Ge, JNormant, EPorter, JRAli, JADembski, MSGao, YGeorges, ATGrenier, LPak, RHPatterson, JSydor, JRTibbitts, TTTong, JKAdams, JPalombella, VJ Design, synthesis, and biological evaluation of hydroquinone derivatives of 17-amino-17-demethoxygeldanamycin as potent, water-soluble inhibitors of Hsp90. J Med Chem 49:4606-15 (2006)  
Target
Name:
Endoplasmin
Synonyms:
ENPL_CANLF HSP90B1 TRA1
Type:
PROTEIN
Mol. Mass.:
92464.42
Organism:
Canis familiaris
Description:
ChEMBL_1478277
Residue:
804
  
Inhibitor
Name:
BDBM50191364
Synonyms:
17-((S)-amino-3,2-propanediol)-17-demethoxygeldanamycin | CHEMBL211296
Type:
Small organic molecule
Emp. Form.:
C31H45N3O10
Mol. Mass.:
619.7031
SMILES:
CO[C@H]1C[C@H](C)Cc2c(O)c(NC(=O)C(C)=CC=C[C@H](OC)[C@@H](OC(N)=O)\C(C)=C\[C@H](C)[C@H]1O)cc(O)c2NCC(=O)CO
: