Target
Delta-type opioid receptor
Ligand
BDBM50272081
Substrate
Meas. Tech.
ChEMBL_366644 (CHEMBL864704)
Ki
0.042000±n/a nM
Citation
 Ballet, SSalvadori, STrapella, CBryant, SDJinsmaa, YLazarus, LHNegri, LGiannini, ELattanzi, RTourwé, DBalboni, G New 2',6'-dimethyl-L-tyrosine (Dmt) opioid peptidomimetics based on the Aba-Gly scaffold. Development of unique mu-opioid receptor ligands. J Med Chem 49:3990-3 (2006)  
Target
Name:
Delta-type opioid receptor
Synonyms:
D-OR-1 Delta opioid receptor OPIATE Delta OPRD1 OPRK1 | opioid receptor, delta 1
Type:
G Protein-Coupled Receptor (GPCR)
Mol. Mass.:
40382.98
Organism:
Homo sapiens (Human)
Description:
Competition binding assays were carried out using membrane preparations from transfected HN9.10 cells that constitutively expressed the delta opioid receptor.
Residue:
372
  
Inhibitor
Name:
BDBM50272081
Synonyms:
2-[2-Amino-3-(4-hydroxy-2,6-dimethyl-phenyl)-propionyl]-1,2,3,4-tetrahydro-isoquinoline-3-carboxylic acid phenylcarbamoylmethyl-amide H-Dmt-Tic-Gly-NH-Ph
Type:
Small organic molecule
Emp. Form.:
C29H32N4O4
Mol. Mass.:
500.5888
SMILES:
Cc1cc(O)cc(C)c1C[C@H](N)C(=O)N1Cc2ccccc2C[C@H]1C(=O)NCC(=O)Nc1ccccc1
: