Target
D(2) dopamine receptor
Ligand
BDBM50189849
Substrate
Meas. Tech.
ChEMBL_367037 (CHEMBL866800)
Ki
8200±n/a nM
Citation
 Enguehard-Gueiffier, CHübner, HEl Hakmaoui, AAllouchi, HGmeiner, PArgiolas, AMelis, MRGueiffier, A 2-[(4-phenylpiperazin-1-yl)methyl]imidazo(di)azines as selective D4-ligands. Induction of penile erection by 2-[4-(2-methoxyphenyl)piperazin-1-ylmethyl]imidazo[1,2-a]pyridine (PIP3EA), a potent and selective D4 partial agonist. J Med Chem 49:3938-47 (2006)  
Target
Name:
D(2) dopamine receptor
Synonyms:
D(2) dopamine receptor DOPAMINE D2 Long DRD2 Dopamine D2 receptor Dopamine D2 receptor (D2R) Dopamine2-like | d2
Type:
Cell-surface receptors
Mol. Mass.:
50647.10
Organism:
Homo sapiens (Human)
Description:
P14416
Residue:
443
  
Inhibitor
Name:
BDBM50189849
Synonyms:
6-chloro-2-[4-(4-chlorophenyl)piperazin-1-ylmethyl]imidazo[1,2-b]pyridazine | CHEMBL211135
Type:
Small organic molecule
Emp. Form.:
C17H17Cl2N5
Mol. Mass.:
362.256
SMILES:
Clc1ccc(cc1)N1CCN(Cc2cn3nc(Cl)ccc3n2)CC1
: