Target
5-hydroxytryptamine receptor 2A
Ligand
BDBM50189840
Substrate
Meas. Tech.
ChEMBL_367041 (CHEMBL866804)
Ki
3400±n/a nM
Citation
 Enguehard-Gueiffier, CHübner, HEl Hakmaoui, AAllouchi, HGmeiner, PArgiolas, AMelis, MRGueiffier, A 2-[(4-phenylpiperazin-1-yl)methyl]imidazo(di)azines as selective D4-ligands. Induction of penile erection by 2-[4-(2-methoxyphenyl)piperazin-1-ylmethyl]imidazo[1,2-a]pyridine (PIP3EA), a potent and selective D4 partial agonist. J Med Chem 49:3938-47 (2006)  
Target
Name:
5-hydroxytryptamine receptor 2A
Synonyms:
5-HT-2 5-HT2 5HT2A_PIG Serotonin 2a (5-HT2a) receptor
Type:
Enzyme Catalytic Domain
Mol. Mass.:
52679.13
Organism:
PIG
Description:
5-HT2 0 0::P50129
Residue:
470
  
Inhibitor
Name:
BDBM50189840
Synonyms:
6-chloro-2-[4-(2-methoxyphenyl)piperazin-1-ylmethyl]imidazo[1,2-b]pyridazine | CHEMBL378515
Type:
Small organic molecule
Emp. Form.:
C18H20ClN5O
Mol. Mass.:
357.837
SMILES:
COc1ccccc1N1CCN(Cc2cn3nc(Cl)ccc3n2)CC1
: