Target
5-hydroxytryptamine receptor 1A
Ligand
BDBM50189856
Substrate
Meas. Tech.
ChEMBL_367040 (CHEMBL866803)
Ki
360±n/a nM
Citation
 Enguehard-Gueiffier, CHübner, HEl Hakmaoui, AAllouchi, HGmeiner, PArgiolas, AMelis, MRGueiffier, A 2-[(4-phenylpiperazin-1-yl)methyl]imidazo(di)azines as selective D4-ligands. Induction of penile erection by 2-[4-(2-methoxyphenyl)piperazin-1-ylmethyl]imidazo[1,2-a]pyridine (PIP3EA), a potent and selective D4 partial agonist. J Med Chem 49:3938-47 (2006)  
Target
Name:
5-hydroxytryptamine receptor 1A
Synonyms:
5-HT-1A 5-hydroxytryptamine receptor 1A (5-HT-1A) ADRB2RL1 Dopamine D2 receptor and serotonin 1a receptor HTR1A | Serotonin receptor 1A
Type:
Mol. Mass.:
46122.49
Organism:
Homo sapiens (Human)
Description:
Residue:
422
  
Inhibitor
Name:
BDBM50189856
Synonyms:
6-chloro-2-[4-(3,4-dichlorophenyl)piperazin-1-ylmethyl]imidazo[1,2-b]pyridazine | CHEMBL209034
Type:
Small organic molecule
Emp. Form.:
C17H16Cl3N5
Mol. Mass.:
396.701
SMILES:
Clc1ccc2nc(CN3CCN(CC3)c3ccc(Cl)c(Cl)c3)cn2n1
: