Target
D(2) dopamine receptor
Ligand
BDBM50189856
Substrate
Meas. Tech.
ChEMBL_367036 (CHEMBL866799)
Ki
1100±n/a nM
Citation
 Enguehard-Gueiffier, CHübner, HEl Hakmaoui, AAllouchi, HGmeiner, PArgiolas, AMelis, MRGueiffier, A 2-[(4-phenylpiperazin-1-yl)methyl]imidazo(di)azines as selective D4-ligands. Induction of penile erection by 2-[4-(2-methoxyphenyl)piperazin-1-ylmethyl]imidazo[1,2-a]pyridine (PIP3EA), a potent and selective D4 partial agonist. J Med Chem 49:3938-47 (2006)  
Target
Name:
D(2) dopamine receptor
Synonyms:
D(2) dopamine receptor DOPAMINE D2 Long DRD2 Dopamine D2 receptor Dopamine D2 receptor (D2R) Dopamine2-like | d2
Type:
Cell-surface receptors
Mol. Mass.:
50647.10
Organism:
Homo sapiens (Human)
Description:
P14416
Residue:
443
  
Inhibitor
Name:
BDBM50189856
Synonyms:
6-chloro-2-[4-(3,4-dichlorophenyl)piperazin-1-ylmethyl]imidazo[1,2-b]pyridazine | CHEMBL209034
Type:
Small organic molecule
Emp. Form.:
C17H16Cl3N5
Mol. Mass.:
396.701
SMILES:
Clc1ccc2nc(CN3CCN(CC3)c3ccc(Cl)c(Cl)c3)cn2n1
: