Target
5-hydroxytryptamine receptor 2A
Ligand
BDBM50189856
Substrate
Meas. Tech.
ChEMBL_367041 (CHEMBL866804)
Ki
1200±n/a nM
Citation
 Enguehard-Gueiffier, CHübner, HEl Hakmaoui, AAllouchi, HGmeiner, PArgiolas, AMelis, MRGueiffier, A 2-[(4-phenylpiperazin-1-yl)methyl]imidazo(di)azines as selective D4-ligands. Induction of penile erection by 2-[4-(2-methoxyphenyl)piperazin-1-ylmethyl]imidazo[1,2-a]pyridine (PIP3EA), a potent and selective D4 partial agonist. J Med Chem 49:3938-47 (2006)  
Target
Name:
5-hydroxytryptamine receptor 2A
Synonyms:
5-HT-2 5-HT2 5HT2A_PIG Serotonin 2a (5-HT2a) receptor
Type:
Enzyme Catalytic Domain
Mol. Mass.:
52679.13
Organism:
PIG
Description:
5-HT2 0 0::P50129
Residue:
470
  
Inhibitor
Name:
BDBM50189856
Synonyms:
6-chloro-2-[4-(3,4-dichlorophenyl)piperazin-1-ylmethyl]imidazo[1,2-b]pyridazine | CHEMBL209034
Type:
Small organic molecule
Emp. Form.:
C17H16Cl3N5
Mol. Mass.:
396.701
SMILES:
Clc1ccc2nc(CN3CCN(CC3)c3ccc(Cl)c(Cl)c3)cn2n1
: