Target
Nitric oxide synthase, brain
Ligand
BDBM50183062
Substrate
Meas. Tech.
ChEMBL_368943 (CHEMBL869062)
IC50
182000±n/a nM
Citation
 Vlahakis, JZKinobe, RTBowers, RJBrien, JFNakatsu, KSzarek, WA Imidazole-dioxolane compounds as isozyme-selective heme oxygenase inhibitors. J Med Chem 49:4437-41 (2006)  
Target
Name:
Nitric oxide synthase, brain
Synonyms:
Bnos NC-NOS NOS type I nNOS Neuronal nitric oxide synthase Nitric Oxide Synthase, brain Nitric oxide synthase, brain (nNOS) Nitric-oxide synthase, brain (nNOS) Nos1 | Peptidyl-cysteine S-nitrosylase NOS1
Type:
Enzyme
Mol. Mass.:
160570.98
Organism:
Rattus norvegicus (rat)
Description:
Recombinant nNOS overexpressed in E. coli was used in enzyme assays.
Residue:
1429
  
Inhibitor
Name:
BDBM50183062
Synonyms:
1-((2-(2-(4-chlorophenyl)ethyl)-1,3-dioxolan-2-yl)methyl)-1H-imidazole hydrochloride 2-[2-(4-chlorophenyl)ethyl]-2-[(1H-imidazol-1-yl)methyl]-1,3-dioxolane hydrochloride CHEMBL541899
Type:
Small organic molecule
Emp. Form.:
C15H17ClN2O2
Mol. Mass.:
292.761
SMILES:
Clc1ccc(CCC2(Cn3ccnc3)OCCO2)cc1
: