Target
Nitric oxide synthase, brain
Ligand
BDBM50183063
Substrate
Meas. Tech.
ChEMBL_368943 (CHEMBL869062)
IC50
362000±n/a nM
Citation
 Vlahakis, JZKinobe, RTBowers, RJBrien, JFNakatsu, KSzarek, WA Imidazole-dioxolane compounds as isozyme-selective heme oxygenase inhibitors. J Med Chem 49:4437-41 (2006)  
Target
Name:
Nitric oxide synthase, brain
Synonyms:
Bnos NC-NOS NOS type I nNOS Neuronal nitric oxide synthase Nitric Oxide Synthase, brain Nitric oxide synthase, brain (nNOS) Nitric-oxide synthase, brain (nNOS) Nos1 | Peptidyl-cysteine S-nitrosylase NOS1
Type:
Enzyme
Mol. Mass.:
160570.98
Organism:
Rattus norvegicus (rat)
Description:
Recombinant nNOS overexpressed in E. coli was used in enzyme assays.
Residue:
1429
  
Inhibitor
Name:
BDBM50183063
Synonyms:
(2R,4R)-2-[2-(4-chlorophenyl)ethyl]-2-[(1H-imidazol-1-yl)-methyl]-4-methyl-1,3-dioxolane hydrochloride CHEMBL536056
Type:
Small organic molecule
Emp. Form.:
C16H19ClN2O2
Mol. Mass.:
306.787
SMILES:
C[C@@H]1CO[C@@](CCc2ccc(Cl)cc2)(Cn2ccnc2)O1
: