Target
Dual specificity tyrosine-phosphorylation-regulated kinase 1A
Ligand
BDBM50187062
Substrate
Meas. Tech.
ChEMBL_375630 (CHEMBL871428)
IC50
20000±n/a nM
Citation
 Kim, NDYoon, JKim, JHLee, JTChon, YSHwang, MKHa, ISong, WJ Putative therapeutic agents for the learning and memory deficits of people with Down syndrome. Bioorg Med Chem Lett 16:3772-6 (2006)  
Target
Name:
Dual specificity tyrosine-phosphorylation-regulated kinase 1A
Synonyms:
DYR1A_MOUSE Dyrk | Dyrk1a
Type:
PROTEIN
Mol. Mass.:
85526.58
Organism:
Mus musculus
Description:
ChEMBL_631605
Residue:
763
  
Inhibitor
Name:
BDBM50187062
Synonyms:
5-(5-(2-(allyloxy)-5-bromobenzylidene)-4-oxo-4,5-dihydrothiazol-2-ylamino)-2-chlorobenzoic acid | CHEMBL211705
Type:
Small organic molecule
Emp. Form.:
C20H14BrClN2O4S
Mol. Mass.:
493.758
SMILES:
OC(=O)c1cc(NC2=NC(=O)C(S2)=Cc2cc(Br)ccc2OCC=C)ccc1Cl
: