Target
Sodium-dependent serotonin transporter
Ligand
BDBM50191635
Substrate
Meas. Tech.
ChEMBL_376263 (CHEMBL864774)
IC50
217±n/a nM
Citation
 Hatzenbuhler, NTEvrard, DAHarrison, BLHuryn, DInghrim, JKraml, CMattes, JFMewshaw, REZhou, DHornby, GLin, QSmith, DLSullivan, KMSchechter, LEBeyer, CEAndree, TH Synthesis and biological evaluation of novel compounds within a class of 3-aminochroman derivatives with dual 5-HT1A receptor and serotonin transporter affinity. J Med Chem 49:4785-9 (2006)  
Target
Name:
Sodium-dependent serotonin transporter
Synonyms:
5-HT Transporter 5HTT SC6A4_HUMAN SLC6A4 Serotonin transporter (5HTT) Sodium-dependent serotonin transporter (SERT) | Solute carrier family 6 member 4
Type:
Multi-pass membrane protein
Mol. Mass.:
70322.51
Organism:
Homo sapiens (Human)
Description:
P31645
Residue:
630
  
Inhibitor
Name:
BDBM50191635
Synonyms:
CHEMBL209784 | rac-8-fluoro-3-[[4-(5-fluoro-1H-indol-3-yl)butyl](propyl)amino] chromane-5-carboxamide
Type:
Small organic molecule
Emp. Form.:
C25H29F2N3O2
Mol. Mass.:
441.5135
SMILES:
CCCN(CCCCc1c[nH]c2ccc(F)cc12)C1COc2c(F)ccc(C(N)=O)c2C1
: