Target
Sodium- and chloride-dependent glycine transporter 1
Ligand
BDBM50188849
Substrate
Meas. Tech.
ChEMBL_379378 (CHEMBL864835)
EC50
56±n/a nM
Citation
 Alberati, DHainzl, DJolidon, SKurt, APinard, EThomas, AWZimmerli, D 4-Substituted-8-(1-phenyl-cyclohexyl)-2,8-diaza-spiro[4.5]decan-1-one as a novel class of highly selective GlyT1 inhibitors with superior pharmacological and pharmacokinetic parameters. Bioorg Med Chem Lett 16:4321-5 (2006)  
Target
Name:
Sodium- and chloride-dependent glycine transporter 1
Synonyms:
GlyT-1 Glycine Transporters (GlyT1c) SC6A9_HUMAN Sodium- and chloride-dependent glycine transporter 1 Sodium- and chloride-dependent glycine transporter 1 (GlyT1c) Solute carrier family 6 member 9
Type:
Enzyme
Mol. Mass.:
78270.54
Organism:
Homo sapiens (Human)
Description:
P48067
Residue:
706
  
Inhibitor
Name:
BDBM50188849
Synonyms:
4-(4-fluoro-phenyl)-8-[1-(4-fluoro-phenyl)-cyclohexyl]-2,8-diaza-spiro[4.5]decan-1-one CHEMBL534940
Type:
Small organic molecule
Emp. Form.:
C26H30F2N2O
Mol. Mass.:
424.526
SMILES:
Fc1ccc(cc1)C1CNC(=O)C11CCN(CC1)C1(CCCCC1)c1ccc(F)cc1
: