Target
Nociceptin receptor
Ligand
BDBM50188856
Substrate
Meas. Tech.
ChEMBL_379380 (CHEMBL864837)
IC50
>10000±n/a nM
Citation
 Alberati, DHainzl, DJolidon, SKurt, APinard, EThomas, AWZimmerli, D 4-Substituted-8-(1-phenyl-cyclohexyl)-2,8-diaza-spiro[4.5]decan-1-one as a novel class of highly selective GlyT1 inhibitors with superior pharmacological and pharmacokinetic parameters. Bioorg Med Chem Lett 16:4321-5 (2006)  
Target
Name:
Nociceptin receptor
Synonyms:
KOR-3 Mu-type opioid receptor (Mu) Nociceptin Receptor (ORL1 Receptor) Nociceptin receptor (ORL-1) Nociceptin/Orphanin FQ, NOP receptor OPIATE ORL-1 OPRL1 protein ORL1 Opioid receptor like-1 Orphanin FQ receptor (ORL1) | P41146
Type:
G Protein-Coupled Receptor (GPCR)
Mol. Mass.:
40702.87
Organism:
Homo sapiens (Human)
Description:
P41146
Residue:
370
  
Inhibitor
Name:
BDBM50188856
Synonyms:
8-[1-(4-chloro-phenyl)-cyclohexyl]-4-phenyl-2,8-diaza-spiro[4.5]decan-1-one | CHEMBL211422
Type:
Small organic molecule
Emp. Form.:
C26H31ClN2O
Mol. Mass.:
422.99
SMILES:
Clc1ccc(cc1)C1(CCCCC1)N1CCC2(CC1)C(CNC2=O)c1ccccc1
: