Target
Sodium- and chloride-dependent glycine transporter 1
Ligand
BDBM50188886
Substrate
Meas. Tech.
ChEMBL_379378 (CHEMBL864835)
EC50
147±n/a nM
Citation
 Alberati, DHainzl, DJolidon, SKurt, APinard, EThomas, AWZimmerli, D 4-Substituted-8-(1-phenyl-cyclohexyl)-2,8-diaza-spiro[4.5]decan-1-one as a novel class of highly selective GlyT1 inhibitors with superior pharmacological and pharmacokinetic parameters. Bioorg Med Chem Lett 16:4321-5 (2006)  
Target
Name:
Sodium- and chloride-dependent glycine transporter 1
Synonyms:
GlyT-1 Glycine Transporters (GlyT1c) SC6A9_HUMAN Sodium- and chloride-dependent glycine transporter 1 Sodium- and chloride-dependent glycine transporter 1 (GlyT1c) Solute carrier family 6 member 9
Type:
Enzyme
Mol. Mass.:
78270.54
Organism:
Homo sapiens (Human)
Description:
P48067
Residue:
706
  
Inhibitor
Name:
BDBM50188886
Synonyms:
CHEMBL380037 | rac-4-phenyl-8-(1-thiophen-2-yl-cyclohexyl)-2,8-diaza-spiro[4.5]decan-1-one
Type:
Small organic molecule
Emp. Form.:
C24H30N2OS
Mol. Mass.:
394.573
SMILES:
O=C1NCC(c2ccccc2)C11CCN(CC1)C1(CCCCC1)c1cccs1
: