Target
Mu-type opioid receptor
Ligand
BDBM50193549
Substrate
Meas. Tech.
ChEMBL_386439 (CHEMBL864218)
EC50
0.500000±n/a nM
Citation
 Nieland, NPMoynihan, HACarrington, SBroadbear, JWoods, JHTraynor, JRHusbands, SMLewis, JW Structural determinants of opioid activity in derivatives of 14-aminomorphinones: effect of substitution in the aromatic ring of cinnamoylaminomorphinones and codeinones. J Med Chem 49:5333-8 (2006)  
Target
Name:
Mu-type opioid receptor
Synonyms:
M-OR-1 MOR-1 MUOR1 Mu opiate receptor OPRM1 hMOP | mu-type opioid receptor isoform MOR-1
Type:
G Protein-Coupled Receptor (GPCR)
Mol. Mass.:
44789.51
Organism:
Homo sapiens (Human)
Description:
P35372
Residue:
400
  
Inhibitor
Name:
BDBM50193549
Synonyms:
14beta-(2'-methylcinnamoylamino)-7,8-dihydrocodeinone
Type:
Small organic molecule
Emp. Form.:
C28H30N2O4
Mol. Mass.:
458.5488
SMILES:
COc1ccc2CC3N(C)CC[C@@]45[C@@H](Oc1c24)C(=O)CC[C@@]35NC(=O)\C=C\c1ccccc1C
: