Target
RNA-directed RNA polymerase
Ligand
BDBM50193063
Substrate
Meas. Tech.
ChEMBL_391864 (CHEMBL862448)
IC50
75±n/a nM
Citation
 Beaulieu, PLGillard, JBykowski, DBrochu, CDansereau, NDuceppe, JSHaché, BJakalian, ALagacé, LLaPlante, SMcKercher, GMoreau, EPerreault, SStammers, TThauvette, LWarrington, JKukolj, G Improved replicon cellular activity of non-nucleoside allosteric inhibitors of HCV NS5B polymerase: from benzimidazole to indole scaffolds. Bioorg Med Chem Lett 16:4987-93 (2006)  
Target
Name:
RNA-directed RNA polymerase
Synonyms:
Hepatitis C virus NS5B RNA-dependent RNA polymerase | NS5B protein
Type:
Protein
Mol. Mass.:
25173.95
Organism:
Hepatitis C virus
Description:
Q8JXU8
Residue:
229
  
Inhibitor
Name:
BDBM50193063
Synonyms:
3-cyclopentyl-2-(furan-3-yl)-7-hydroxy-1-methyl-1H-indole-6-carboxylic acid | CHEMBL387405
Type:
Small organic molecule
Emp. Form.:
C19H19NO4
Mol. Mass.:
325.3585
SMILES:
Cn1c(-c2ccoc2)c(C2CCCC2)c2ccc(C(O)=O)c(O)c12
: