Target
Delta-type opioid receptor
Ligand
BDBM50370757
Substrate
Meas. Tech.
ChEMBL_392922 (CHEMBL870416)
Ki
170±n/a nM
Citation
 Wentland, MPVanAlstine, MKucejko, RLou, RCohen, DJParkhill, ALBidlack, JM Redefining the structure-activity relationships of 2,6-methano-3-benzazocines. 4. Opioid receptor binding properties of 8-[N-(4'-phenyl)-phenethyl)carboxamido] analogues of cyclazocine and ethylketocycalzocine. J Med Chem 49:5635-9 (2006)  
Target
Name:
Delta-type opioid receptor
Synonyms:
D-OR-1 Delta opioid receptor OPIATE Delta OPRD1 OPRK1 | opioid receptor, delta 1
Type:
G Protein-Coupled Receptor (GPCR)
Mol. Mass.:
40382.98
Organism:
Homo sapiens (Human)
Description:
Competition binding assays were carried out using membrane preparations from transfected HN9.10 cells that constitutively expressed the delta opioid receptor.
Residue:
372
  
Inhibitor
Name:
BDBM50370757
Synonyms:
CHEMBL1162933
Type:
Small organic molecule
Emp. Form.:
C32H36N2O
Mol. Mass.:
464.641
SMILES:
CC1C2Cc3ccc(cc3C1(C)CCN2CC1CC1)C(=O)NCc1ccc(cc1)-c1ccccc1
: