Target
Mu-type opioid receptor
Ligand
BDBM50194269
Substrate
Meas. Tech.
ChEMBL_392924 (CHEMBL870418)
Ki
18±n/a nM
Citation
 Wentland, MPVanAlstine, MKucejko, RLou, RCohen, DJParkhill, ALBidlack, JM Redefining the structure-activity relationships of 2,6-methano-3-benzazocines. 4. Opioid receptor binding properties of 8-[N-(4'-phenyl)-phenethyl)carboxamido] analogues of cyclazocine and ethylketocycalzocine. J Med Chem 49:5635-9 (2006)  
Target
Name:
Mu-type opioid receptor
Synonyms:
M-OR-1 MOR-1 MUOR1 Mu opiate receptor OPRM1 hMOP | mu-type opioid receptor isoform MOR-1
Type:
G Protein-Coupled Receptor (GPCR)
Mol. Mass.:
44789.51
Organism:
Homo sapiens (Human)
Description:
P35372
Residue:
400
  
Inhibitor
Name:
BDBM50194269
Synonyms:
(+/-)-3-(cyclopropylmethyl)-1,2,3,4,5,6-hexahydro-cis-6,11-dimethyl-N-[1,1'-biphenyl]-4-yl-2,6-methano-3-benzazocine-8-carboxamide | CHEMBL215760
Type:
Small organic molecule
Emp. Form.:
C31H34N2O
Mol. Mass.:
450.6145
SMILES:
C[C@H]1C2Cc3ccc(cc3[C@@]1(C)CCN2CC1CC1)C(=O)Nc1ccc(cc1)-c1ccccc1
: