Target
Fatty acid synthase
Ligand
BDBM50191688
Substrate
Meas. Tech.
ChEMBL_396903 (CHEMBL862461)
IC50
49100±n/a nM
Citation
 Na, MJang, JMin, BSLee, SJLee, MSKim, BYOh, WKAhn, JS Fatty acid synthase inhibitory activity of acylphloroglucinols isolated from Dryopteris crassirhizoma. Bioorg Med Chem Lett 16:4738-42 (2006)  
Target
Name:
Fatty acid synthase
Synonyms:
FAS FAS_HUMAN HU FASN
Type:
Enzyme
Mol. Mass.:
273419.37
Organism:
Homo sapiens (Human)
Description:
P49327
Residue:
2511
  
Inhibitor
Name:
BDBM50191688
Synonyms:
CHEMBL214690 | aspidinol-B
Type:
Small organic molecule
Emp. Form.:
C12H16O4
Mol. Mass.:
224.253
SMILES:
CCCC(=O)c1c(O)cc(OC)c(C)c1O
: