Target
Fatty acid synthase
Ligand
BDBM50191689
Substrate
Meas. Tech.
ChEMBL_396903 (CHEMBL862461)
IC50
56100±n/a nM
Citation
 Na, MJang, JMin, BSLee, SJLee, MSKim, BYOh, WKAhn, JS Fatty acid synthase inhibitory activity of acylphloroglucinols isolated from Dryopteris crassirhizoma. Bioorg Med Chem Lett 16:4738-42 (2006)  
Target
Name:
Fatty acid synthase
Synonyms:
FAS FAS_HUMAN HU FASN
Type:
Enzyme
Mol. Mass.:
273419.37
Organism:
Homo sapiens (Human)
Description:
P49327
Residue:
2511
  
Inhibitor
Name:
BDBM50191689
Synonyms:
CHEMBL424703 | albaspidin-PB
Type:
Small organic molecule
Emp. Form.:
C24H30O8
Mol. Mass.:
446.4902
SMILES:
CCCC(=O)C1C(=O)C(CC2C(=O)C(C(=O)CC)C(=O)C(C)(C)C2=O)C(=O)C(C)(C)C1=O
: