Target
P2Y purinoceptor 6
Ligand
BDBM50194152
Substrate
Meas. Tech.
ChEMBL_402044 (CHEMBL866173)
EC50
15±n/a nM
Citation
 Besada, PShin, DHCostanzi, SKo, HMathé, CGagneron, JGosselin, GMaddileti, SHarden, TKJacobson, KA Structure-activity relationships of uridine 5'-diphosphate analogues at the human P2Y6 receptor. J Med Chem 49:5532-43 (2006)  
Target
Name:
P2Y purinoceptor 6
Synonyms:
P2RY6 P2Y purinoceptor 6 Pyrimidinergic receptor P2Y6
Type:
PROTEIN
Mol. Mass.:
36452.29
Organism:
Homo sapiens (Human)
Description:
ChEMBL_1511151
Residue:
328
  
Inhibitor
Name:
BDBM50194152
Synonyms:
(2R,3R,4S,5R)-1-(3,4-dihydroxy-5-(diphosphoryloxymethyl)-tetrahydrofuran-2-yl)-5-iodopyrimidine-2,4(1H,3H)-dione ammonium salt
Type:
Small organic molecule
Emp. Form.:
C9H13IN2O12P2
Mol. Mass.:
530.0577
SMILES:
O[C@H]1[C@@H](O)[C@@H](O[C@@H]1COP(O)(=O)OP(O)(O)=O)n1c(I)cc(=O)[nH]c1=O
: