Target
Prothrombin
Ligand
BDBM50192102
Substrate
Meas. Tech.
ChEMBL_404138 (CHEMBL909748)
IC50
5500±n/a nM
Citation
 Lazarova, TIJin, LRynkiewicz, MGorga, JCBibbins, FMeyers, HVBabine, RStrickler, J Synthesis and in vitro biological evaluation of aryl boronic acids as potential inhibitors of factor XIa. Bioorg Med Chem Lett 16:5022-7 (2006)  
Target
Name:
Prothrombin
Synonyms:
Activation peptide fragment 1 Coagulation factor II Prothrombin precursor Thrombin heavy chain | Thrombin light chain
Type:
Protein
Mol. Mass.:
70029.57
Organism:
Homo sapiens (Human)
Description:
P00734
Residue:
622
  
Inhibitor
Name:
BDBM50192102
Synonyms:
CHEMBL213434 | N-[4-(4,4,5,5-tetramethyl-[1,3,2]dioxaborolan-2-yl)-phenyl]-guanidine trifluoro-acetic acid
Type:
Small organic molecule
Emp. Form.:
C13H20BN3O2
Mol. Mass.:
261.128
SMILES:
[#6]C1([#6])[#8]-[#5](-[#8]C1([#6])[#6])-c1ccc(cc1)\[#7]=[#6](\[#7])-[#7]
: