Target
Cholinesterase
Ligand
BDBM50199522
Substrate
Meas. Tech.
ChEMBL_410403 (CHEMBL911223)
IC50
>10000±n/a nM
Citation
 Camps, PGómez, EMuñoz-Torrero, DBadia, AClos, MVCurutchet, CMuñoz-Muriedas, JLuque, FJ Binding of 13-amidohuprines to acetylcholinesterase: exploring the ligand-induced conformational change of the gly117-gly118 peptide bond in the oxyanion hole. J Med Chem 49:6833-40 (2006)  
Target
Name:
Cholinesterase
Synonyms:
Acylcholine acylhydrolase Butyrylcholine esterase (BChE) Butyrylcholinesterase (BuChE) CHLE_HUMAN Cholinesterases Pseudocholinesterase
Type:
Homotetramer
Mol. Mass.:
68422.27
Organism:
Homo sapiens (Human)
Description:
P06276
Residue:
602
  
Inhibitor
Name:
BDBM50199522
Synonyms:
(+)-huperzine A (-)-1-Amino-13-ethylidene-11-methyl-6-aza-tricyclo[7.3.1.0*2,7*]trideca-2(7),3,10-trien-5-one(Huperzine A) (-)-huperzine A (1R,9R)-1-Amino-13-eth-(E)-ylidene-11-methyl-6-aza-tricyclo[7.3.1.0*2,7*]trideca-2(7),3,10-trien-5-one (R)-1-Amino-13-ethylidene-11-methyl-6-aza-tricyclo[7.3.1.0*2,7*]trideca-2(7),3,10-trien-5-one 1-Amino-13-eth-(E)-ylidene-11-methyl-6-aza-tricyclo[7.3.1.0*2,7*]trideca-2(7),3,10-trien-5-one 1-Amino-13-ethylidene-11-methyl-6-aza-tricyclo[7.3.1.0*2,7*]trideca-2(7),3,10-trien-5-one 1-Amino-13-ethylidene-11-methyl-6-aza-tricyclo[7.3.1.0*2,7*]trideca-2(7),3,10-trien-5-one((-)-Huperzine A) CHEMBL395280 Hyperazzine A
Type:
Small organic molecule
Emp. Form.:
C15H18N2O
Mol. Mass.:
242.3162
SMILES:
C\C=C1/[C@@H]2Cc3[nH]c(=O)ccc3[C@@]1(N)CC(C)=C2
: