Target
Alpha-2B adrenergic receptor
Ligand
BDBM50200351
Substrate
Meas. Tech.
ChEMBL_410552 (CHEMBL912421)
Ki
10±n/a nM
Citation
 Cueva, JPGiorgioni, GGrubbs, RAChemel, BRWatts, VJNichols, DE trans-2,3-dihydroxy-6a,7,8,12b-tetrahydro-6H-chromeno[3,4-c]isoquinoline: synthesis, resolution, and preliminary pharmacological characterization of a new dopamine D1 receptor full agonist. J Med Chem 49:6848-57 (2006)  
Target
Name:
Alpha-2B adrenergic receptor
Synonyms:
ADA2B_HUMAN ADRA2L1 Adrenergic alpha2B Adrenergic receptor alpha Alpha-2 adrenergic receptor subtype C2 Alpha-2B adrenoreceptor | Alpha-2BAR
Type:
Enzyme
Mol. Mass.:
49964.20
Organism:
Homo sapiens (Human)
Description:
P18089
Residue:
450
  
Inhibitor
Name:
BDBM50200351
Synonyms:
(+/-)-2,3-dihydroxy-6a,7,8,12b-tetrahydro-6H-chromeno[3,4-c]isoquinoline | CHEMBL217299
Type:
Small organic molecule
Emp. Form.:
C16H15NO3
Mol. Mass.:
269.2952
SMILES:
Oc1cc2OCC3NCc4ccccc4C3c2cc1O
: