Target
Histone deacetylase 1
Ligand
BDBM50195107
Substrate
Meas. Tech.
ChEMBL_422136 (CHEMBL907072)
IC50
190±n/a nM
Citation
 Jones, PAltamura, SChakravarty, PKCecchetti, ODe Francesco, RGallinari, PIngenito, RMeinke, PTPetrocchi, ARowley, MScarpelli, RSerafini, SSteinkühler, C A series of novel, potent, and selective histone deacetylase inhibitors. Bioorg Med Chem Lett 16:5948-52 (2006)  
Target
Name:
Histone deacetylase 1
Synonyms:
Cereblon/Histone deacetylase 1 HDAC1 Histone deacetylase 1 (HDAC1) RPD3L1
Type:
Enzyme
Mol. Mass.:
55090.27
Organism:
Homo sapiens (Human)
Description:
Q13547
Residue:
482
  
Inhibitor
Name:
BDBM50195107
Synonyms:
(S)-8-oxo-N-(2-(2-phenyl-1H-indol-3-yl)ethyl)-2-(2-(piperidin-1-yl)acetamido)nonanamide | CHEMBL217371
Type:
Small organic molecule
Emp. Form.:
C32H42N4O3
Mol. Mass.:
530.7009
SMILES:
CC(=O)CCCCC[C@H](NC(=O)CN1CCCCC1)C(=O)NCCc1c([nH]c2ccccc12)-c1ccccc1
: