Target
Histone deacetylase 1
Ligand
BDBM50195114
Substrate
Meas. Tech.
ChEMBL_422136 (CHEMBL907072)
IC50
>5000±n/a nM
Citation
 Jones, PAltamura, SChakravarty, PKCecchetti, ODe Francesco, RGallinari, PIngenito, RMeinke, PTPetrocchi, ARowley, MScarpelli, RSerafini, SSteinkühler, C A series of novel, potent, and selective histone deacetylase inhibitors. Bioorg Med Chem Lett 16:5948-52 (2006)  
Target
Name:
Histone deacetylase 1
Synonyms:
Cereblon/Histone deacetylase 1 HDAC1 Histone deacetylase 1 (HDAC1) RPD3L1
Type:
Enzyme
Mol. Mass.:
55090.27
Organism:
Homo sapiens (Human)
Description:
Q13547
Residue:
482
  
Inhibitor
Name:
BDBM50195114
Synonyms:
(S)-N-ethyl-2-(2-(5-methoxy-2-methyl-1H-indol-3-yl)acetamido)-8-oxononanamide | CHEMBL386965
Type:
Small organic molecule
Emp. Form.:
C23H33N3O4
Mol. Mass.:
415.5258
SMILES:
CCNC(=O)[C@H](CCCCCC(C)=O)NC(=O)Cc1c(C)[nH]c2ccc(OC)cc12
: