Target
Histone deacetylase 1
Ligand
BDBM50195122
Substrate
Meas. Tech.
ChEMBL_422136 (CHEMBL907072)
IC50
560±n/a nM
Citation
 Jones, PAltamura, SChakravarty, PKCecchetti, ODe Francesco, RGallinari, PIngenito, RMeinke, PTPetrocchi, ARowley, MScarpelli, RSerafini, SSteinkühler, C A series of novel, potent, and selective histone deacetylase inhibitors. Bioorg Med Chem Lett 16:5948-52 (2006)  
Target
Name:
Histone deacetylase 1
Synonyms:
Cereblon/Histone deacetylase 1 HDAC1 Histone deacetylase 1 (HDAC1) RPD3L1
Type:
Enzyme
Mol. Mass.:
55090.27
Organism:
Homo sapiens (Human)
Description:
Q13547
Residue:
482
  
Inhibitor
Name:
BDBM50195122
Synonyms:
(S)-2-(2-(5-methoxy-2-methyl-1H-indol-3-yl)acetamido)-N-((2-methyl-1H-indol-3-yl)methyl)-8-oxononanamide | CHEMBL385626
Type:
Small organic molecule
Emp. Form.:
C31H38N4O4
Mol. Mass.:
530.6578
SMILES:
COc1ccc2[nH]c(C)c(CC(=O)N[C@@H](CCCCCC(C)=O)C(=O)NCc3c(C)[nH]c4ccccc34)c2c1
: