Target
Histone deacetylase 2
Ligand
BDBM50195108
Substrate
Meas. Tech.
ChEMBL_422130 (CHEMBL907066)
IC50
4±n/a nM
Citation
 Jones, PAltamura, SChakravarty, PKCecchetti, ODe Francesco, RGallinari, PIngenito, RMeinke, PTPetrocchi, ARowley, MScarpelli, RSerafini, SSteinkühler, C A series of novel, potent, and selective histone deacetylase inhibitors. Bioorg Med Chem Lett 16:5948-52 (2006)  
Target
Name:
Histone deacetylase 2
Synonyms:
Cereblon/Histone deacetylase 2 HDAC2 Histone deacetylase 2 (HDAC2) | Human HDAC2
Type:
Chromatin regulator; hydrolase; repressor
Mol. Mass.:
55356.54
Organism:
Homo sapiens (Human)
Description:
Q92769
Residue:
488
  
Inhibitor
Name:
BDBM50195108
Synonyms:
(S)-N8-hydroxy-2-(2-(5-methoxy-2-methyl-1H-indol-3-yl)acetamido)-N1-(2-(2-phenyl-1H-indol-3-yl)ethyl)octanediamide | CHEMBL216641
Type:
Small organic molecule
Emp. Form.:
C36H41N5O5
Mol. Mass.:
623.7412
SMILES:
COc1ccc2[nH]c(C)c(CC(=O)N[C@@H](CCCCCC(=O)NO)C(=O)NCCc3c([nH]c4ccccc34)-c3ccccc3)c2c1
: