Target
Egl nine homolog 1
Ligand
BDBM50370804
Substrate
Meas. Tech.
ChEMBL_424037 (CHEMBL855665)
IC50
10000±n/a nM
Citation
 Warshakoon, NCWu, SBoyer, AKawamoto, RSheville, JBhatt, RTRenock, SXu, KPokross, MZhou, SWalter, RMekel, MEvdokimov, AGEast, S Design and synthesis of substituted pyridine derivatives as HIF-1alpha prolyl hydroxylase inhibitors. Bioorg Med Chem Lett 16:5616-20 (2006)  
Target
Name:
Egl nine homolog 1
Synonyms:
C1orf12 EGLN1_HUMAN Hypoxia-inducible factor prolyl hydroxylase 2 (HIF-PH2) Prolyl hydroxylase domain-containing protein 2 (PHD2)
Type:
Protein
Mol. Mass.:
46035.59
Organism:
Homo sapiens (Human)
Description:
Q9GZT9
Residue:
426
  
Inhibitor
Name:
BDBM50370804
Synonyms:
CHEMBL218233
Type:
Small organic molecule
Emp. Form.:
C16H13N3O3
Mol. Mass.:
295.2927
SMILES:
COc1cccc(c1)-c1ccc(nc1)-n1cc(cn1)C(O)=O
: