Target
Prostaglandin D2 receptor
Ligand
BDBM50193921
Substrate
Meas. Tech.
ChEMBL_424246 (CHEMBL909020)
Ki
>500±n/a nM
Citation
 Belley, MChan, CCGareau, YGallant, MJuteau, HHoude, KLachance, NLabelle, MSawyer, NTremblay, NLamontagne, SCarrière, MCDenis, DGreig, GMSlipetz, DGordon, RChauret, NLi, CZamboni, RJMetters, KM Comparison between two classes of selective EP(3) antagonists and their biological activities. Bioorg Med Chem Lett 16:5639-42 (2006)  
Target
Name:
Prostaglandin D2 receptor
Synonyms:
PD2R_HUMAN Prostaglandin D2 Prostanoid DP receptor
Type:
Enzyme
Mol. Mass.:
40288.87
Organism:
Homo sapiens (Human)
Description:
Q13258
Residue:
359
  
Inhibitor
Name:
BDBM50193921
Synonyms:
3-(2-(naphthalen-2-ylmethyl)phenyl)-N-(thiophen-2-ylsulfonyl)acrylamide | CHEMBL220802
Type:
Small organic molecule
Emp. Form.:
C24H19NO3S2
Mol. Mass.:
433.543
SMILES:
O=C(NS(=O)(=O)c1cccs1)\C=C\c1ccccc1Cc1ccc2ccccc2c1
: