Target
Prostaglandin E2 receptor EP3 subtype
Ligand
BDBM50193937
Substrate
Meas. Tech.
ChEMBL_424228 (CHEMBL909002)
Ki
2.4±n/a nM
Citation
 Belley, MChan, CCGareau, YGallant, MJuteau, HHoude, KLachance, NLabelle, MSawyer, NTremblay, NLamontagne, SCarrière, MCDenis, DGreig, GMSlipetz, DGordon, RChauret, NLi, CZamboni, RJMetters, KM Comparison between two classes of selective EP(3) antagonists and their biological activities. Bioorg Med Chem Lett 16:5639-42 (2006)  
Target
Name:
Prostaglandin E2 receptor EP3 subtype
Synonyms:
PE2R3_HUMAN PGE2-R Prostaglandin E2 receptor Prostaglandin E2 receptor EP3 subtype (EP3) Prostaglandin E2 receptor EP3D subtype (EP3D) | Prostanoid EP3 receptor
Type:
Enzyme
Mol. Mass.:
43335.03
Organism:
Homo sapiens (Human)
Description:
P43115
Residue:
390
  
Inhibitor
Name:
BDBM50193937
Synonyms:
3-(2-((E)-3-(4-methoxyphenyl)prop-1-enyl)phenyl)-N-(thiophen-2-ylsulfonyl)acrylamide | CHEMBL218229
Type:
Small organic molecule
Emp. Form.:
C23H21NO4S2
Mol. Mass.:
439.547
SMILES:
COc1ccc(C\C=C\c2ccccc2\C=C\C(=O)NS(=O)(=O)c2cccs2)cc1
: