Target
Prostaglandin E2 receptor EP3 subtype
Ligand
BDBM50193919
Substrate
Meas. Tech.
ChEMBL_424228 (CHEMBL909002)
Ki
56±n/a nM
Citation
 Belley, MChan, CCGareau, YGallant, MJuteau, HHoude, KLachance, NLabelle, MSawyer, NTremblay, NLamontagne, SCarrière, MCDenis, DGreig, GMSlipetz, DGordon, RChauret, NLi, CZamboni, RJMetters, KM Comparison between two classes of selective EP(3) antagonists and their biological activities. Bioorg Med Chem Lett 16:5639-42 (2006)  
Target
Name:
Prostaglandin E2 receptor EP3 subtype
Synonyms:
PE2R3_HUMAN PGE2-R Prostaglandin E2 receptor Prostaglandin E2 receptor EP3 subtype (EP3) Prostaglandin E2 receptor EP3D subtype (EP3D) | Prostanoid EP3 receptor
Type:
Enzyme
Mol. Mass.:
43335.03
Organism:
Homo sapiens (Human)
Description:
P43115
Residue:
390
  
Inhibitor
Name:
BDBM50193919
Synonyms:
3-(2-(3-(2-(benzyloxy)-5-methylphenyl)propyl)phenyl)-N-(thiophen-2-ylsulfonyl)propanamide | CHEMBL220821
Type:
Small organic molecule
Emp. Form.:
C30H31NO4S2
Mol. Mass.:
533.701
SMILES:
Cc1ccc(OCc2ccccc2)c(CCCc2ccccc2CCC(=O)NS(=O)(=O)c2cccs2)c1
: