Target
Prostaglandin E2 receptor EP4 subtype
Ligand
BDBM50193932
Substrate
Meas. Tech.
ChEMBL_424229 (CHEMBL909003)
Ki
440±n/a nM
Citation
 Belley, MChan, CCGareau, YGallant, MJuteau, HHoude, KLachance, NLabelle, MSawyer, NTremblay, NLamontagne, SCarrière, MCDenis, DGreig, GMSlipetz, DGordon, RChauret, NLi, CZamboni, RJMetters, KM Comparison between two classes of selective EP(3) antagonists and their biological activities. Bioorg Med Chem Lett 16:5639-42 (2006)  
Target
Name:
Prostaglandin E2 receptor EP4 subtype
Synonyms:
PE2R4_HUMAN PGE2 receptor EP4 subtype PTGER4 Prostanoid EP4 receptor
Type:
Enzyme
Mol. Mass.:
53134.53
Organism:
Homo sapiens (Human)
Description:
P35408
Residue:
488
  
Inhibitor
Name:
BDBM50193932
Synonyms:
3-(2-(3-(2-(benzyloxy)-5-methylphenyl)propyl)phenyl)propanoic acid | CHEMBL220820
Type:
Small organic molecule
Emp. Form.:
C26H28O3
Mol. Mass.:
388.4987
SMILES:
Cc1ccc(OCc2ccccc2)c(CCCc2ccccc2CCC(O)=O)c1
: