Target
Sodium- and chloride-dependent glycine transporter 1
Ligand
BDBM50195169
Substrate
Meas. Tech.
ChEMBL_424803 (CHEMBL909052)
IC50
3.2±n/a nM
Citation
 Zhao, ZO'Brien, JALemaire, WWilliams, DLJacobson, MASur, CPettibone, DJTiller, PRSmith, SHartman, GDWolkenberg, SELindsley, CW Synthesis and SAR of GlyT1 inhibitors derived from a series of N-((4-(morpholine-4-carbonyl)-1-(propylsulfonyl)piperidin-4-yl)methyl)benzamides. Bioorg Med Chem Lett 16:5968-72 (2006)  
Target
Name:
Sodium- and chloride-dependent glycine transporter 1
Synonyms:
GlyT-1 Glycine transporter 1 Slc6a9 Solute carrier family 6 member 9
Type:
Enzyme Catalytic Domain
Mol. Mass.:
71066.17
Organism:
attus norvegicus (Rat)
Description:
Glycine-1-transporter 0 HUMAN::P28572
Residue:
638
  
Inhibitor
Name:
BDBM50195169
Synonyms:
2,4-dichloro-N-((4-(morpholine-4-carbonyl)-1-(propylsulfonyl)piperidin-4-yl)methyl)benzamide | CHEMBL376472
Type:
Small organic molecule
Emp. Form.:
C21H29Cl2N3O5S
Mol. Mass.:
506.443
SMILES:
CCCS(=O)(=O)N1CCC(CNC(=O)c2ccc(Cl)cc2Cl)(CC1)C(=O)N1CCOCC1
: