Target
Enoyl-acyl-carrier protein reductase
Ligand
BDBM50187665
Substrate
Meas. Tech.
ChEMBL_425609 (CHEMBL910785)
IC50
7000±n/a nM
Citation
 Sharma, SKParasuraman, PKumar, GSurolia, NSurolia, A Green tea catechins potentiate triclosan binding to enoyl-ACP reductase from Plasmodium falciparum (PfENR). J Med Chem 50:765-75 (2007)  
Target
Name:
Enoyl-acyl-carrier protein reductase
Synonyms:
Type:
PROTEIN
Mol. Mass.:
49770.86
Organism:
Plasmodium falciparum
Description:
ChEMBL_795989
Residue:
432
  
Inhibitor
Name:
BDBM50187665
Synonyms:
(-)-epigallocatechin | CHEMBL47386
Type:
Small organic molecule
Emp. Form.:
C15H14O7
Mol. Mass.:
306.2675
SMILES:
O[C@@H]1Cc2c(O)cc(O)cc2O[C@@H]1c1cc(O)c(O)c(O)c1
: