Target
Enoyl-acyl-carrier protein reductase
Ligand
BDBM50153015
Substrate
Meas. Tech.
ChEMBL_425611 (CHEMBL910787)
Ki
291±n/a nM
Citation
 Sharma, SKParasuraman, PKumar, GSurolia, NSurolia, A Green tea catechins potentiate triclosan binding to enoyl-ACP reductase from Plasmodium falciparum (PfENR). J Med Chem 50:765-75 (2007)  
Target
Name:
Enoyl-acyl-carrier protein reductase
Synonyms:
Type:
PROTEIN
Mol. Mass.:
49770.86
Organism:
Plasmodium falciparum
Description:
ChEMBL_795989
Residue:
432
  
Inhibitor
Name:
BDBM50153015
Synonyms:
(-)-Epicatechin-3-gallate (-)-epicatechin gallate (-)epicatechingallate (2R,3R)-2-(3,4-dihydroxyphenyl)-5,7-dihydroxychroman-3-yl 3,4,5-trihydroxybenzoate 3,4,5-Trihydroxy-benzoic acid 2-(3,4-dihydroxy-phenyl)-5,7-dihydroxy-chroman-3-yl ester Epicatechin gallate | Epicatechin-3-O-gallate
Type:
Small organic molecule
Emp. Form.:
C22H18O10
Mol. Mass.:
442.3723
SMILES:
Oc1cc(O)c2C[C@@H](OC(=O)c3cc(O)c(O)c(O)c3)[C@H](Oc2c1)c1ccc(O)c(O)c1
: