Target
Enoyl-acyl-carrier protein reductase
Ligand
BDBM50042949
Substrate
Meas. Tech.
ChEMBL_425613 (CHEMBL910789)
Ki
14±n/a nM
Citation
 Sharma, SKParasuraman, PKumar, GSurolia, NSurolia, A Green tea catechins potentiate triclosan binding to enoyl-ACP reductase from Plasmodium falciparum (PfENR). J Med Chem 50:765-75 (2007)  
Target
Name:
Enoyl-acyl-carrier protein reductase
Synonyms:
Type:
PROTEIN
Mol. Mass.:
49770.86
Organism:
Plasmodium falciparum
Description:
ChEMBL_795989
Residue:
432
  
Inhibitor
Name:
BDBM50042949
Synonyms:
(E)-1-(2,4-dihydroxyphenyl)-3-(3,4-dihydroxyphenyl)-2-propen-1-one (21) (E)-3-(3,4-Dihydroxy-phenyl)-1-(2,4-dihydroxy-phenyl)-propenone 3-(3,4-Dihydroxy-phenyl)-1-(2,4-dihydroxy-phenyl)-propenone CHEMBL128000
Type:
Small organic molecule
Emp. Form.:
C15H12O5
Mol. Mass.:
272.2528
SMILES:
Oc1ccc(C(=O)\C=C\c2ccc(O)c(O)c2)c(O)c1
: