Target
Enoyl-[acyl-carrier-protein] reductase [NADH] FabI
Ligand
BDBM7460
Substrate
Meas. Tech.
ChEMBL_425610 (CHEMBL910786)
IC50
20000±n/a nM
Citation
 Sharma, SKParasuraman, PKumar, GSurolia, NSurolia, A Green tea catechins potentiate triclosan binding to enoyl-ACP reductase from Plasmodium falciparum (PfENR). J Med Chem 50:765-75 (2007)  
Target
Name:
Enoyl-[acyl-carrier-protein] reductase [NADH] FabI
Synonyms:
Enoyl - (acyl carrier protein) reductase Enoyl-[acyl-carrier-protein] reductase FABI_ECOLI envM | fabI
Type:
Enzyme
Mol. Mass.:
27861.12
Organism:
Escherichia coli
Description:
Residue:
262
  
Inhibitor
Name:
BDBM7460
Synonyms:
2-(3,4-dihydroxyphenyl)-3,5,7-trihydroxy-4H-chromen-4-one 2-(3,4-dihydroxyphenyl)-3,5,7-trihydroxy-chromone;hydrate Quercetin Quercetin (21) US11021454, Compound Quercetin med.21724, Compound 4
Type:
Small organic molecule
Emp. Form.:
C15H10O7
Mol. Mass.:
302.2357
SMILES:
Oc1cc(O)c2c(c1)oc(-c1ccc(O)c(O)c1)c(O)c2=O
: