Target
Glutamate receptor ionotropic, kainate 1
Ligand
BDBM50207593
Substrate
Meas. Tech.
ChEMBL_429146 (CHEMBL904263)
Kd
18±n/a nM
Citation
 Dolman, NPMore, JCAlt, AKnauss, JLPentikäinen, OTGlasser, CRBleakman, DMayer, MLCollingridge, GLJane, DE Synthesis and pharmacological characterization of N3-substituted willardiine derivatives: role of the substituent at the 5-position of the uracil ring in the development of highly potent and selective GLUK5 kainate receptor antagonists. J Med Chem 50:1558-70 (2007)  
Target
Name:
Glutamate receptor ionotropic, kainate 1
Synonyms:
GRIK1_RAT Glutamate receptor ionotropic kainate 1 Glutamate receptor, ionotropic kainate 1 Grik1
Type:
Enzyme Catalytic Domain
Mol. Mass.:
107860.82
Organism:
RAT
Description:
P22756
Residue:
949
  
Inhibitor
Name:
BDBM50207593
Synonyms:
(S)-1-(2-AMINO-2-CARBOXYETHYL)-3(2-CARBOXYTHIOPHENE-3-YL-METHYL)-5-METHYLPYRIMIDINE-2,4-DIONE CHEMBL373428
Type:
Small organic molecule
Emp. Form.:
C14H15N3O6S
Mol. Mass.:
353.35
SMILES:
Cc1cn(C[C@H](N)C(O)=O)c(=O)n(Cc2ccsc2C(O)=O)c1=O
: