Target
ATP-dependent translocase ABCB1
Ligand
BDBM50207922
Substrate
Meas. Tech.
ChEMBL_429163 (CHEMBL914418)
EC50
125±n/a nM
Citation
 Kaiser, DTerfloth, LKopp, SSchulz, Jde Laet, RChiba, PEcker, GFGasteiger, J Self-organizing maps for identification of new inhibitors of P-glycoprotein. J Med Chem 50:1698-702 (2007)  
Target
Name:
ATP-dependent translocase ABCB1
Synonyms:
ABCB1 MDR1_HUMAN Multidrug resistance protein 1 P-glycoprotein (P-gp) PGY1
Type:
Protein
Mol. Mass.:
141503.50
Organism:
Homo sapiens (Human)
Description:
P08183
Residue:
1280
  
Inhibitor
Name:
BDBM50207922
Synonyms:
1-(4,5-dichloro-2-(2-hydroxy-3-(4-o-tolylpiperazin-1-yl)propoxy)phenyl)ethanone | CHEMBL376913
Type:
Small organic molecule
Emp. Form.:
C22H26Cl2N2O3
Mol. Mass.:
437.359
SMILES:
CC(=O)c1cc(Cl)c(Cl)cc1OCC(O)CN1CCN(CC1)c1ccccc1C
: