Target
ATP-dependent translocase ABCB1
Ligand
BDBM50370900
Substrate
Meas. Tech.
ChEMBL_429163 (CHEMBL914418)
EC50
110±n/a nM
Citation
 Kaiser, DTerfloth, LKopp, SSchulz, Jde Laet, RChiba, PEcker, GFGasteiger, J Self-organizing maps for identification of new inhibitors of P-glycoprotein. J Med Chem 50:1698-702 (2007)  
Target
Name:
ATP-dependent translocase ABCB1
Synonyms:
ABCB1 MDR1_HUMAN Multidrug resistance protein 1 P-glycoprotein (P-gp) PGY1
Type:
Protein
Mol. Mass.:
141503.50
Organism:
Homo sapiens (Human)
Description:
P08183
Residue:
1280
  
Inhibitor
Name:
BDBM50370900
Synonyms:
CHEMBL222220
Type:
Small organic molecule
Emp. Form.:
C30H26N2O2S2
Mol. Mass.:
510.67
SMILES:
CC(=O)c1c(C)cc(C)c(CSc2nc3ccc(NC(=O)c4cccc5ccccc45)cc3s2)c1C
: