Target
Adenosine receptor A2a
Ligand
BDBM50208784
Substrate
Meas. Tech.
ChEMBL_429487 (CHEMBL918609)
Ki
16.1±n/a nM
Citation
 Adachi, HPalaniappan, KKIvanov, AABergman, NGao, ZGJacobson, KA Structure-activity relationships of 2,N(6),5'-substituted adenosine derivatives with potent activity at the A2B adenosine receptor. J Med Chem 50:1810-27 (2007)  
Target
Name:
Adenosine receptor A2a
Synonyms:
A2A adenosine receptor (hA2A) ADENOSINE A2 ADORA2 Adenosine A2A receptor (A2AAR)
Type:
G Protein-Coupled Receptor (GPCR)
Mol. Mass.:
44716.46
Organism:
Homo sapiens (Human)
Description:
P29274
Residue:
412
  
Inhibitor
Name:
BDBM50208784
Synonyms:
(2R,3R,4S,5R)-2-(6-amino-2-(2-(naphthalen-2-yl)ethoxy)-9H-purin-9-yl)-5-(hydroxymethyl)-tetrahydrofuran-3,4-diol | CHEMBL374760
Type:
Small organic molecule
Emp. Form.:
C22H23N5O5
Mol. Mass.:
437.4485
SMILES:
Nc1nc(OCCc2ccc3ccccc3c2)nc2n(cnc12)[C@@H]1O[C@H](CO)[C@@H](O)[C@H]1O
: