Target
Sodium-dependent serotonin transporter
Ligand
BDBM50156916
Substrate
Meas. Tech.
ChEMBL_429833 (CHEMBL915414)
Ki
0.96±n/a nM
Citation
 Carroll, FIRunyon, SPAbraham, PNavarro, HKuhar, MJPollard, GTHoward, JL Monoamine transporter binding, locomotor activity, and drug discrimination properties of 3-(4-substituted-phenyl)tropane-2-carboxylic acid methyl ester isomers. J Med Chem 47:6401-9 (2004)  
Target
Name:
Sodium-dependent serotonin transporter
Synonyms:
5-HT Transporter 5HTT SC6A4_HUMAN SLC6A4 Serotonin transporter (5HTT) Sodium-dependent serotonin transporter (SERT) | Solute carrier family 6 member 4
Type:
Multi-pass membrane protein
Mol. Mass.:
70322.51
Organism:
Homo sapiens (Human)
Description:
P31645
Residue:
630
  
Inhibitor
Name:
BDBM50156916
Synonyms:
(1R)-3beta-(4-bromophenyl)tropane-2beta-carboxylicacid methyl ester CHEMBL218082
Type:
Small organic molecule
Emp. Form.:
C16H20BrNO2
Mol. Mass.:
338.24
SMILES:
COC(=O)[C@@H]1C2CCC(C[C@@H]1c1ccc(Br)cc1)N2C
: